Reaction Details
TargetTransient receptor potential cation channel subfamily A member 1
LigandBDBM50318482
Substrate/Competitorn/a
Meas. Tech.ChEMBL_633014 (CHEMBL1118239)
EC50 56000±n/a nM
Citation Baraldi, PGPreti, DMaterazzi, SGeppetti, P Transient receptor potential ankyrin 1 (TRPA1) channel as emerging target for novel analgesics and anti-inflammatory agents. J Med Chem53:5085-107 (2010) 
 
Transient receptor potential cation channel subfamily A member 1
Name:Transient receptor potential cation channel subfamily A member 1
Type:PROTEIN
Mol. Mass.:128485.09
Organism:Mus musculus
Description:ChEMBL_1367709
Residue:1125
BDBM50318482
NameBDBM50318482
Synonyms:(-)-menthol MENTHOL l-menthol
TypeSmall organic molecule
Emp. Form.C10H20O
Mol. Mass.156.2652
SMILESCC(C)[C@@H]1CC[C@@H](C)C[C@H]1O