Reaction Details
TargetWD repeat-containing protein 5
LigandBDBM50318535
Substrate/Competitorn/a
Meas. Tech.ChEMBL_633068 (CHEMBL1118768)
Ki 7300±n/a nM
Citation Karatas, HTownsend, ECBernard, DDou, YWang, S Analysis of the binding of mixed lineage leukemia 1 (MLL1) and histone 3 peptides to WD repeat domain 5 (WDR5) for the design of inhibitors of the MLL1-WDR5 interaction. J Med Chem53:5179-85 (2010) 
 
WD repeat-containing protein 5
Name:WD repeat-containing protein 5
Type:Protein
Mol. Mass.:36597.13
Organism:Homo sapiens (Human)
Description:P61964
Residue:334
BDBM50318535
NameBDBM50318535
Synonyms:CHEMBL1086456 | H2N-ARAEVHLRKS-NH2
TypeSmall organic molecule
Emp. Form.C49H88N20O13
Mol. Mass.1165.3492
SMILESCC(C)C[C@H](NC(=O)[C@H](Cc1cnc[nH]1)NC(=O)[C@@H](NC(=O)[C@H](CCC(O)=O)NC(=O)[C@H](C)NC(=O)[C@H](CCCN=C(N)N)NC(=O)[C@H](C)N)C(C)C)C(=O)N[C@@H](CCCN=C(N)N)C(=O)N[C@@H](CCCCN)C(=O)N[C@@H](CO)C(N)=O