Reaction Details
TargetWD repeat-containing protein 5
LigandBDBM50318548
Substrate/Competitorn/a
Meas. Tech.ChEMBL_633068 (CHEMBL1118768)
Ki 120±n/a nM
Citation Karatas, HTownsend, ECBernard, DDou, YWang, S Analysis of the binding of mixed lineage leukemia 1 (MLL1) and histone 3 peptides to WD repeat domain 5 (WDR5) for the design of inhibitors of the MLL1-WDR5 interaction. J Med Chem53:5179-85 (2010) 
 
WD repeat-containing protein 5
Name:WD repeat-containing protein 5
Type:Protein
Mol. Mass.:36597.13
Organism:Homo sapiens (Human)
Description:P61964
Residue:334
BDBM50318548
NameBDBM50318548
Synonyms:Ac-ARA-NH2 | CHEMBL1086455
TypeSmall organic molecule
Emp. Form.C14H27N7O4
Mol. Mass.357.4087
SMILES[#6]-[#6@H](-[#7]-[#6](=O)-[#6@H](-[#6]-[#6]-[#6]\[#7]=[#6](/[#7])-[#7])-[#7]-[#6](=O)-[#6@H](-[#6])-[#7]-[#6](-[#6])=O)-[#6](-[#7])=O