Reaction Details
Target5-hydroxytryptamine receptor 6
LigandBDBM50318628
Substrate/Competitorn/a
Meas. Tech.ChEMBL_633199 (CHEMBL1118855)
Ki 0.49±n/a nM
Citation Ivachtchenko, AVDmitriev, DEGolovina, ESKadieva, MGKoryakova, AGKysil, VMMitkin, ODOkun, IMTkachenko, SEVorobiev, AA (3-Phenylsulfonylcycloalkano[e and d]pyrazolo[1,5-a]pyrimidin-2-yl)amines: potent and selective antagonists of the serotonin 5-HT6 receptor. J Med Chem53:5186-96 (2010) 
 
5-hydroxytryptamine receptor 6
Name:5-hydroxytryptamine receptor 6
Type:G Protein-Coupled Receptor (GPCR)
Mol. Mass.:46968.43
Organism:Homo sapiens (Human)
Description:P50406
Residue:440
BDBM50318628
NameBDBM50318628
Synonyms:CHEMBL1083076 | N,5-Dimethyl-3-(phenylsulfonyl)-6,7,8,9-tetrahydropyrazolo-[1,5-a]quinazolin-2-amine
TypeSmall organic molecule
Emp. Form.C18H20N4O2S
Mol. Mass.356.442
SMILESCNc1nn2c3CCCCc3c(C)nc2c1S(=O)(=O)c1ccccc1