Reaction Details
Target5-hydroxytryptamine receptor 6
LigandBDBM50318627
Substrate/Competitorn/a
Meas. Tech.ChEMBL_633201 (CHEMBL1118857)
Ki 0.413±n/a nM
Citation Ivachtchenko, AVDmitriev, DEGolovina, ESKadieva, MGKoryakova, AGKysil, VMMitkin, ODOkun, IMTkachenko, SEVorobiev, AA (3-Phenylsulfonylcycloalkano[e and d]pyrazolo[1,5-a]pyrimidin-2-yl)amines: potent and selective antagonists of the serotonin 5-HT6 receptor. J Med Chem53:5186-96 (2010) 
 
5-hydroxytryptamine receptor 6
Name:5-hydroxytryptamine receptor 6
Type:G Protein-Coupled Receptor (GPCR)
Mol. Mass.:46968.43
Organism:Homo sapiens (Human)
Description:P50406
Residue:440
BDBM50318627
NameBDBM50318627
Synonyms:CHEMBL1083075 | N,5-Dimethyl-3-(phenylsulfonyl)-7,8-dihydro-6H-cyclopenta-[e]pyrazolo[1,5-a]pyrimidin-2-amine
TypeSmall organic molecule
Emp. Form.C17H18N4O2S
Mol. Mass.342.415
SMILESCNc1nn2c3CCCc3c(C)nc2c1S(=O)(=O)c1ccccc1