Reaction Details
Target5-hydroxytryptamine receptor 6
LigandBDBM50318634
Substrate/Competitorn/a
Meas. Tech.ChEMBL_633206 (CHEMBL1118862)
Ki 0.85±n/a nM
Citation Ivachtchenko, AVDmitriev, DEGolovina, ESKadieva, MGKoryakova, AGKysil, VMMitkin, ODOkun, IMTkachenko, SEVorobiev, AA (3-Phenylsulfonylcycloalkano[e and d]pyrazolo[1,5-a]pyrimidin-2-yl)amines: potent and selective antagonists of the serotonin 5-HT6 receptor. J Med Chem53:5186-96 (2010) 
 
5-hydroxytryptamine receptor 6
Name:5-hydroxytryptamine receptor 6
Type:G Protein-Coupled Receptor (GPCR)
Mol. Mass.:46968.43
Organism:Homo sapiens (Human)
Description:P50406
Residue:440
BDBM50318634
NameBDBM50318634
Synonyms:CHEMBL1084244 Ro-65-7674
TypeSmall organic molecule
Emp. Form.C19H21N5O2S
Mol. Mass.383.467
SMILESO=S(=O)(c1cnn2c(N3CCNCC3)c3CCCc3nc12)c1ccccc1