Reaction Details
TargetEstrogen receptor beta
LigandBDBM20607
Substrate/Competitorn/a
Meas. Tech.ChEMBL_633223 (CHEMBL1119430)
IC50 1660±n/a nM
Citation Shen, JTan, CZhang, YLi, XLi, WHuang, JShen, XTang, Y Discovery of potent ligands for estrogen receptor beta by structure-based virtual screening. J Med Chem53:5361-5 (2010) 
 
Estrogen receptor beta
Name:Estrogen receptor beta
Type:Protein
Mol. Mass.:59238.43
Organism:Homo sapiens (Human)
Description:Q92731
Residue:530
BDBM20607
NameBDBM20607
Synonyms:(2-{4-[(1Z)-1,2-diphenylbut-1-en-1-yl]phenoxy}ethyl)dimethylamine CHEMBL83 NCGC00024928 Tamoxifen Tamoxifen, 7 med.21724, Compound Tamoxifen
TypeSmall organic molecule
Emp. Form.C26H29NO
Mol. Mass.371.5146
SMILESCC\C(=C(/c1ccccc1)c1ccc(OCCN(C)C)cc1)c1ccccc1