Reaction Details
TargetKappa-type opioid receptor
LigandBDBM50318682
Substrate/Competitorn/a
Meas. Tech.ChEMBL_633488 (CHEMBL1119300)
EC50 6±n/a nM
Citation Runyon, SPBrieaddy, LEMascarella, SWThomas, JBNavarro, HAHoward, JLPollard, GTCarroll, FI Analogues of (3R)-7-hydroxy-N-[(1S)-1-{[(3R,4R)-4-(3-hydroxyphenyl)-3,4-dimethyl-1-piperidinyl]methyl}-2-methylpropyl)-1,2,3,4-tetrahydro-3-isoquinolinecarboxamide (JDTic). Synthesis and in vitro and in vivo opioid receptor antagonist activity. J Med Chem53:5290-301 (2010) 
 
Kappa-type opioid receptor
Name:Kappa-type opioid receptor
Type:G Protein-Coupled Receptor (GPCR)
Mol. Mass.:42648.76
Organism:Homo sapiens (Human)
Description:P41145
Residue:380
BDBM50318682
NameBDBM50318682
Synonyms:6-Hydroxy-1,2,3,4-tetrahydro-naphthalene-2(+)-carboxylic Acid-{1-[4-(3-hydroxyphenyl)-(3R,4R)-trans-dimethyl-piperidinylmethyl]-(2S)-methylpropyl}amide | CHEMBL1085023
TypeSmall organic molecule
Emp. Form.C29H40N2O3
Mol. Mass.464.6395
SMILESCC(C)[C@@H](CN1CC[C@](C)([C@@H](C)C1)c1cccc(O)c1)NC(=O)[C@@H]1CCc2cc(O)ccc2C1