Reaction Details
TargetcGMP-dependent protein kinase 2
LigandBDBM50319716
Substrate/Competitorn/a
Meas. Tech.ChEMBL_634834 (CHEMBL1120084)
IC50 24±n/a nM
Citation Bosanac, THickey, ERGinn, JKashem, MKerr, SKugler, SLi, XOlague, ASchlyer, SYoung, ER Substituted 2H-isoquinolin-1-ones as potent Rho-kinase inhibitors: part 3, aryl substituted pyrrolidines. Bioorg Med Chem Lett20:3746-9 (2010) 
 
cGMP-dependent protein kinase 2
Name:cGMP-dependent protein kinase 2
Type:PROTEIN
Mol. Mass.:87448.25
Organism:Homo sapiens (Human)
Description:ChEMBL_774533
Residue:762
BDBM50319716
NameBDBM50319716
Synonyms:(3S,4R)-N-(7-chloro-1-oxo-1,2-dihydroisoquinolin-6-yl)-4-(4-chlorophenyl)pyrrolidine-3-carboxamide | CHEMBL1082821
TypeSmall organic molecule
Emp. Form.C20H17Cl2N3O2
Mol. Mass.402.274
SMILESClc1ccc(cc1)[C@@H]1CNC[C@H]1C(=O)Nc1cc2cc[nH]c(=O)c2cc1Cl