Reaction Details
TargetSodium-dependent serotonin transporter
LigandBDBM50319829
Substrate/Competitorn/a
Meas. Tech.ChEMBL_634877 (CHEMBL1120509)
Ki 16±n/a nM
Citation Fray, MJFish, PVAllan, GABish, GClarke, NEccles, RHarrison, ACLe Net, JLPhillips, SCRegan, NSobry, CStobie, AWakenhut, FWestbrook, DWestbrook, SLWhitlock, GA Second generation N-(1,2-diphenylethyl)piperazines as dual serotonin and noradrenaline reuptake inhibitors: improving metabolic stability and reducing ion channel activity. Bioorg Med Chem Lett20:3788-92 (2010) 
 
Sodium-dependent serotonin transporter
Name:Sodium-dependent serotonin transporter
Type:Multi-pass membrane protein
Mol. Mass.:70322.51
Organism:Homo sapiens (Human)
Description:P31645
Residue:630
BDBM50319829
NameBDBM50319829
Synonyms:1-(1-(3-fluorophenyl)-2-(2-(trifluoromethoxy)phenyl)ethyl)piperazine | CHEMBL1083427
TypeSmall organic molecule
Emp. Form.C19H20F4N2O
Mol. Mass.368.3685
SMILESFc1cccc(c1)C(Cc1ccccc1OC(F)(F)F)N1CCNCC1