Reaction Details
TargetSodium-dependent noradrenaline transporter
LigandBDBM50319830
Substrate/Competitorn/a
Meas. Tech.ChEMBL_634878 (CHEMBL1120510)
Ki 200±n/a nM
Citation Fray, MJFish, PVAllan, GABish, GClarke, NEccles, RHarrison, ACLe Net, JLPhillips, SCRegan, NSobry, CStobie, AWakenhut, FWestbrook, DWestbrook, SLWhitlock, GA Second generation N-(1,2-diphenylethyl)piperazines as dual serotonin and noradrenaline reuptake inhibitors: improving metabolic stability and reducing ion channel activity. Bioorg Med Chem Lett20:3788-92 (2010) 
 
Sodium-dependent noradrenaline transporter
Name:Sodium-dependent noradrenaline transporter
Type:Multi-pass membrane protein
Mol. Mass.:69337.72
Organism:Homo sapiens (Human)
Description:P23975
Residue:617
BDBM50319830
NameBDBM50319830
Synonyms:(+)-1-(1-(4-fluorophenyl)-2-(2-(trifluoromethoxy)phenyl)ethyl)piperazine 1-(1-(4-FLUOROPHENYL)-2-(2-(TRIFLUOROMETHOXY)PHENYL)ETHYL)PIPERAZINE (ENANTIOMERIC MIX) CHEMBL1084033
TypeSmall organic molecule
Emp. Form.C19H20F4N2O
Mol. Mass.368.3685
SMILESFc1ccc(cc1)C(Cc1ccccc1OC(F)(F)F)N1CCNCC1