Reaction Details
TargetPolyunsaturated fatty acid lipoxygenase ALOX12
LigandBDBM50320447
Substrate/Competitorn/a
Meas. Tech.ChEMBL_636739 (CHEMBL1167028)
IC50 3100±n/a nM
Citation Robinson, SJHoobler, EKRiener, MLoveridge, STTenney, KValeriote, FAHolman, TRCrews, P Using enzyme assays to evaluate the structure and bioactivity of sponge-derived meroterpenes. J Nat Prod72:1857-63 (2009) 
 
Polyunsaturated fatty acid lipoxygenase ALOX12
Name:Polyunsaturated fatty acid lipoxygenase ALOX12
Type:Protein
Mol. Mass.:75689.18
Organism:Homo sapiens (Human)
Description:P18054
Residue:663
BDBM50320447
NameBDBM50320447
Synonyms:CHEMBL1164369 | isojaspic acid
TypeSmall organic molecule
Emp. Form.C27H38O3
Mol. Mass.410.5888
SMILES[#6]\[#6](-[#6])=[#6]\[#6]-[#6][C@@]1([#6])[#6]-[#6]-[#6][C@]2([#6])[#6@H](-[#6]-c3cc(ccc3-[#8])-[#6](-[#8])=O)-[#6](-[#6])=[#6]-[#6]-[#6@@H]12