Reaction Details
TargetPolyunsaturated fatty acid lipoxygenase ALOX12
LigandBDBM50320453
Substrate/Competitorn/a
Meas. Tech.ChEMBL_636732 (CHEMBL1167021)
IC50>150000±n/a nM
Citation Robinson, SJHoobler, EKRiener, MLoveridge, STTenney, KValeriote, FAHolman, TRCrews, P Using enzyme assays to evaluate the structure and bioactivity of sponge-derived meroterpenes. J Nat Prod72:1857-63 (2009) 
 
Polyunsaturated fatty acid lipoxygenase ALOX12
Name:Polyunsaturated fatty acid lipoxygenase ALOX12
Type:Protein
Mol. Mass.:75689.18
Organism:Homo sapiens (Human)
Description:P18054
Residue:663
BDBM50320453
NameBDBM50320453
Synonyms:15-Oxo-puupehenoic Acid | CHEMBL1165243
TypeSmall organic molecule
Emp. Form.C22H28O4
Mol. Mass.356.4553
SMILESCC1(C)CCC[C@@]2(C)[C@H]1CC[C@]1(C)Oc3cccc(C(O)=O)c3C(=O)[C@H]21