Reaction Details
TargetNeuraminidase
LigandBDBM50320766
Substrate/Competitorn/a
Meas. Tech.ChEMBL_639158 (CHEMBL1167419)
IC50>200000±n/a nM
Citation Wen, WHWang, SYTsai, KCCheng, YSYang, ASFang, JMWong, CH Analogs of zanamivir with modified C4-substituents as the inhibitors against the group-1 neuraminidases of influenza viruses. Bioorg Med Chem18:4074-84 (2010) 
 
Neuraminidase
Name:Neuraminidase
Type:PROTEIN
Mol. Mass.:49687.56
Organism:Influenza A virus
Description:ChEMBL_1347422
Residue:453
BDBM50320766
NameBDBM50320766
Synonyms:5-Acetamido-2,6-anhydro-4-(3-aminopropyl)amino-3,4,5-trideoxy-D-glycero-D-galacto-non-2-enonic acid | CHEMBL1164064
TypeSmall organic molecule
Emp. Form.C14H25N3O7
Mol. Mass.347.3642
SMILESCC(=O)N[C@@H]1[C@@H](NCCCN)C=C(O[C@H]1[C@H](O)[C@H](O)CO)C(O)=O