Reaction Details
TargetNeuronal acetylcholine receptor subunit alpha-7
LigandBDBM50143282
Substrate/Competitorn/a
Meas. Tech.ChEMBL_639431 (CHEMBL1168404)
Ki 300±n/a nM
Citation Dallanoce, CFrigerio, FMartelli, GGrazioso, GMatera, CPomè, DYPucci, LClementi, FGotti, CDe Amici, M Novel tricyclic Delta(2)-isoxazoline and 3-oxo-2-methyl-isoxazolidine derivatives: synthesis and binding affinity at neuronal nicotinic acetylcholine receptor subtypes. Bioorg Med Chem18:4498-508 (2010) 
 
Neuronal acetylcholine receptor subunit alpha-7
Name:Neuronal acetylcholine receptor subunit alpha-7
Type:Enzyme
Mol. Mass.:56502.44
Organism:Rattus norvegicus (Rat)
Description:Q05941
Residue:502
BDBM50143282
NameBDBM50143282
Synonyms:(-)-cytisine (1R,9R)-7,11-diazatricyclo[7.3.1.0~2,7~]trideca-2,4-dien-6-one (1R,9S)-7,11-diazatricyclo[7.3.1.0~2,7~]trideca-2,4-dien-6-one 1,2,3,4,5,6-Hexahydro-1,5-methano-pyrido[1,2-a][1,5]diazocin-8-one CHEMBL497939 cytisine
TypeSmall organic molecule
Emp. Form.C11H14N2O
Mol. Mass.190.2417
SMILESO=c1cccc2[C@H]3CNC[C@H](C3)Cn12