Reaction Details
TargetKappa-type opioid receptor
LigandBDBM50321024
Substrate/Competitorn/a
Meas. Tech.ChEMBL_639432 (CHEMBL1168405)
Ki 15±n/a nM
Citation Yamaotsu, NFujii, HNagase, HHirono, S Identification of the three-dimensional pharmacophore of kappa-opioid receptor agonists. Bioorg Med Chem18:4446-52 (2010) 
 
Kappa-type opioid receptor
Name:Kappa-type opioid receptor
Type:G Protein-Coupled Receptor (GPCR)
Mol. Mass.:42648.76
Organism:Homo sapiens (Human)
Description:P41145
Residue:380
BDBM50321024
NameBDBM50321024
Synonyms:(1R,2S,4R,5S)-dimethyl 3,7-dimethyl-9-oxo-2,4-di(pyridin-2-yl)-3,7-diazabicyclo[3.3.1]nonane-1,5-dicarboxylate | CHEMBL1163522
TypeSmall organic molecule
Emp. Form.C23H26N4O5
Mol. Mass.438.4763
SMILESCOC(=O)[C@@]12CN(C)C[C@]([C@H](N(C)[C@H]1c1ccccn1)c1ccccn1)(C(=O)OC)C2=O