Reaction Details
Target3-hydroxy-3-methylglutaryl-coenzyme A reductase
LigandBDBM50321279
Substrate/Competitorn/a
Meas. Tech.ChEMBL_638412 (CHEMBL1167858)
IC50 71400±n/a nM
Citation Argüelles, NSánchez-Sandoval, EMendieta, AVilla-Tanaca, LGarduño-Siciliano, LJiménez, FCruz, Mdel CMedina-Franco, JLChamorro-Cevallos, GTamariz, J Design, synthesis, and docking of highly hypolipidemic agents: Schizosaccharomyces pombe as a new model for evaluating alpha-asarone-based HMG-CoA reductase inhibitors. Bioorg Med Chem18:4238-48 (2010) 
 
3-hydroxy-3-methylglutaryl-coenzyme A reductase
Name:3-hydroxy-3-methylglutaryl-coenzyme A reductase
Type:PROTEIN
Mol. Mass.:114890.37
Organism:Schizosaccharomyces pombe
Description:ChEMBL_638412
Residue:1053
BDBM50321279
NameBDBM50321279
Synonyms:1-chloro-4,5-dimethoxy-2-(prop-1-enyl)benzene | CHEMBL1165438
TypeSmall organic molecule
Emp. Form.C11H13ClO2
Mol. Mass.212.673
SMILESCOc1cc(Cl)c(\C=C\C)cc1OC