Reaction Details
Target3-hydroxy-3-methylglutaryl-coenzyme A reductase
LigandBDBM50321266
Substrate/Competitorn/a
Meas. Tech.ChEMBL_638412 (CHEMBL1167858)
IC50 128800±n/a nM
Citation Argüelles, NSánchez-Sandoval, EMendieta, AVilla-Tanaca, LGarduño-Siciliano, LJiménez, FCruz, Mdel CMedina-Franco, JLChamorro-Cevallos, GTamariz, J Design, synthesis, and docking of highly hypolipidemic agents: Schizosaccharomyces pombe as a new model for evaluating alpha-asarone-based HMG-CoA reductase inhibitors. Bioorg Med Chem18:4238-48 (2010) 
 
3-hydroxy-3-methylglutaryl-coenzyme A reductase
Name:3-hydroxy-3-methylglutaryl-coenzyme A reductase
Type:PROTEIN
Mol. Mass.:114890.37
Organism:Schizosaccharomyces pombe
Description:ChEMBL_638412
Residue:1053
BDBM50321266
NameBDBM50321266
Synonyms:4-chloro-N-(2-(2-methoxy-4-(prop-1-enyl)phenoxy)ethyl)benzamide | CHEMBL1163690
TypeSmall organic molecule
Emp. Form.C19H20ClNO3
Mol. Mass.345.82
SMILESCOc1cc(\C=C\C)ccc1OCCNC(=O)c1ccc(Cl)cc1