Reaction Details
TargetMembrane-bound transcription factor site-1 protease
LigandBDBM50378793
Substrate/Competitorn/a
Meas. Tech.ChEMBL_641529 (CHEMBL1175363)
Ki 140000±n/a nM
Citation Basak, AMitra, DDas, AKMohottalage, DBasak, A C(2)-Symmetric azobenzene-amino acid conjugates and their inhibition of Subtilisin Kexin Isozyme-1. Bioorg Med Chem Lett20:3977-81 (2010) 
 
Membrane-bound transcription factor site-1 protease
Name:Membrane-bound transcription factor site-1 protease
Type:PROTEIN
Mol. Mass.:117773.36
Organism:Homo sapiens (Human)
Description:ChEMBL_641529
Residue:1052
BDBM50378793
NameBDBM50378793
Synonyms:CHEMBL1170298
TypeSmall organic molecule
Emp. Form.C52H50N6O10
Mol. Mass.918.9876
SMILESOC(=O)[C@H](Cc1ccccc1)NC(=O)[C@H](Cc1ccccc1)NC(=O)COc1ccccc1\N=N\c1ccccc1OCC(=O)N[C@@H](Cc1ccccc1)C(=O)N[C@@H](Cc1ccccc1)C(O)=O