Reaction Details
Target3-phosphoinositide-dependent protein kinase 1
LigandBDBM50321377
Substrate/Competitorn/a
Meas. Tech.ChEMBL_640311 (CHEMBL1174636)
EC50 23000±n/a nM
Citation Wei, LGao, XWarne, RHao, XBussiere, DGu, XJUno, TLiu, Y Design and synthesis of benzoazepin-2-one analogs as allosteric binders targeting the PIF pocket of PDK1. Bioorg Med Chem Lett20:3897-902 (2010) 
 
3-phosphoinositide-dependent protein kinase 1
Name:3-phosphoinositide-dependent protein kinase 1
Type:Enzyme
Mol. Mass.:63157.65
Organism:Homo sapiens (Human)
Description:O15530
Residue:556
BDBM50321377
NameBDBM50321377
Synonyms:2-(3-(4-chlorophenylthio)-2-oxo-2,3,4,5-tetrahydro-1H-benzo[b]azepin-1-yl)aceticacid | CHEMBL1171955
TypeSmall organic molecule
Emp. Form.C18H16ClNO3S
Mol. Mass.361.843
SMILESOC(=O)CN1c2ccccc2CCC(Sc2ccc(Cl)cc2)C1=O