Reaction Details
TargetP2Y purinoceptor 1
LigandBDBM50321584
Substrate/Competitorn/a
Meas. Tech.ChEMBL_639731 (CHEMBL1175620)
Ki 600±n/a nM
Citation Thalji, RKAiyar, NDavenport, EAErhardt, JAKallal, LAMorrow, DMSenadhi, SBurns-Kurtis, CLMarino, JP Benzofuran-substituted urea derivatives as novel P2Y(1) receptor antagonists. Bioorg Med Chem Lett20:4104-7 (2010) 
 
P2Y purinoceptor 1
Name:P2Y purinoceptor 1
Type:Enzyme
Mol. Mass.:42090.25
Organism:Homo sapiens (Human)
Description:P47900
Residue:373
BDBM50321584
NameBDBM50321584
Synonyms:1-(2-(2-isopropylphenyl)benzofuran-7-yl)-3-(4-(trifluoromethoxy)phenyl)urea | CHEMBL1172139
TypeSmall organic molecule
Emp. Form.C25H21F3N2O3
Mol. Mass.454.441
SMILESCC(C)c1ccccc1-c1cc2cccc(NC(=O)Nc3ccc(OC(F)(F)F)cc3)c2o1