Reaction Details
TargetP2Y purinoceptor 1
LigandBDBM50321585
Substrate/Competitorn/a
Meas. Tech.ChEMBL_639731 (CHEMBL1175620)
Ki 400±n/a nM
Citation Thalji, RKAiyar, NDavenport, EAErhardt, JAKallal, LAMorrow, DMSenadhi, SBurns-Kurtis, CLMarino, JP Benzofuran-substituted urea derivatives as novel P2Y(1) receptor antagonists. Bioorg Med Chem Lett20:4104-7 (2010) 
 
P2Y purinoceptor 1
Name:P2Y purinoceptor 1
Type:Enzyme
Mol. Mass.:42090.25
Organism:Homo sapiens (Human)
Description:P47900
Residue:373
BDBM50321585
NameBDBM50321585
Synonyms:1-(2-(2-tert-butylphenyl)benzofuran-7-yl)-3-(4-(trifluoromethoxy)phenyl)urea | CHEMBL1170183
TypeSmall organic molecule
Emp. Form.C26H23F3N2O3
Mol. Mass.468.4676
SMILESCC(C)(C)c1ccccc1-c1cc2cccc(NC(=O)Nc3ccc(OC(F)(F)F)cc3)c2o1