Reaction Details
TargetP2Y purinoceptor 1
LigandBDBM50321587
Substrate/Competitorn/a
Meas. Tech.ChEMBL_639731 (CHEMBL1175620)
Ki 640±n/a nM
Citation Thalji, RKAiyar, NDavenport, EAErhardt, JAKallal, LAMorrow, DMSenadhi, SBurns-Kurtis, CLMarino, JP Benzofuran-substituted urea derivatives as novel P2Y(1) receptor antagonists. Bioorg Med Chem Lett20:4104-7 (2010) 
 
P2Y purinoceptor 1
Name:P2Y purinoceptor 1
Type:Enzyme
Mol. Mass.:42090.25
Organism:Homo sapiens (Human)
Description:P47900
Residue:373
BDBM50321587
NameBDBM50321587
Synonyms:1-(4-butoxyphenyl)-3-(2-(2-isopropylphenyl)benzofuran-7-yl)urea | CHEMBL1170327
TypeSmall organic molecule
Emp. Form.C28H30N2O3
Mol. Mass.442.5494
SMILESCCCCOc1ccc(NC(=O)Nc2cccc3cc(oc23)-c2ccccc2C(C)C)cc1