Reaction Details
TargetMethionine aminopeptidase 1
LigandBDBM50121347
Substrate/Competitorn/a
Meas. Tech.ChEMBL_639876 (CHEMBL1173891)
IC50 47800±n/a nM
Citation Altmeyer, MAMarschner, ASchiffmann, RKlein, CD Subtype-selectivity of metal-dependent methionine aminopeptidase inhibitors. Bioorg Med Chem Lett20:4038-44 (2010) 
 
Methionine aminopeptidase 1
Name:Methionine aminopeptidase 1
Type:Enzyme
Mol. Mass.:43220.79
Organism:Homo sapiens (Human)
Description:MetAP1 with an N-terminal six histidine tag was expressed in baculovirus infected sf9 cells.
Residue:386
BDBM50121347
NameBDBM50121347
Synonyms:CHEMBL625 | THIABENDAZOLE
TypeSmall organic molecule
Emp. Form.C10H7N3S
Mol. Mass.201.248
SMILESc1nc(cs1)-c1nc2ccccc2[nH]1