Reaction Details
Target5-hydroxytryptamine receptor 2C
LigandBDBM50321891
Substrate/Competitorn/a
Meas. Tech.ChEMBL_642099 (CHEMBL1176403)
Ki 4±n/a nM
Citation Cummings, DFCanseco, DCSheth, PJohnson, JESchetz, JA Synthesis and structure-affinity relationships of novel small molecule natural product derivatives capable of discriminating between serotonin 5-HT1A, 5-HT2A, 5-HT2C receptor subtypes. Bioorg Med Chem18:4783-92 (2011) 
 
5-hydroxytryptamine receptor 2C
Name:5-hydroxytryptamine receptor 2C
Type:G Protein-Coupled Receptor (GPCR)
Mol. Mass.:51836.79
Organism:Homo sapiens (Human)
Description:P28335
Residue:458
BDBM50321891
NameBDBM50321891
Synonyms:6-Chloro-2,3-dihydro-indole-1-carboxylic acid [6-(2-methyl-pyridin-3-yloxy)-pyridin-3-yl]-amide CHEMBL299726
TypeSmall organic molecule
Emp. Form.C20H17ClN4O2
Mol. Mass.380.828
SMILESCc1ncccc1Oc1ccc(NC(=O)N2CCc3ccc(Cl)cc23)cn1