Reaction Details
Target5-hydroxytryptamine receptor 2C
LigandBDBM50321875
Substrate/Competitorn/a
Meas. Tech.ChEMBL_642099 (CHEMBL1176403)
Ki 7.9±n/a nM
Citation Cummings, DFCanseco, DCSheth, PJohnson, JESchetz, JA Synthesis and structure-affinity relationships of novel small molecule natural product derivatives capable of discriminating between serotonin 5-HT1A, 5-HT2A, 5-HT2C receptor subtypes. Bioorg Med Chem18:4783-92 (2011) 
 
5-hydroxytryptamine receptor 2C
Name:5-hydroxytryptamine receptor 2C
Type:G Protein-Coupled Receptor (GPCR)
Mol. Mass.:51836.79
Organism:Homo sapiens (Human)
Description:P28335
Residue:458
BDBM50321875
NameBDBM50321875
Synonyms:5,6-Dichloro-2,3-dihydro-indole-1-carboxylic acid pyridin-3-ylamide CHEMBL297043
TypeSmall organic molecule
Emp. Form.C14H11Cl2N3O
Mol. Mass.308.163
SMILESClc1cc2CCN(C(=O)Nc3cccnc3)c2cc1Cl