Reaction Details
Target5-hydroxytryptamine receptor 2C
LigandBDBM50321886
Substrate/Competitorn/a
Meas. Tech.ChEMBL_642099 (CHEMBL1176403)
Ki 46±n/a nM
Citation Cummings, DFCanseco, DCSheth, PJohnson, JESchetz, JA Synthesis and structure-affinity relationships of novel small molecule natural product derivatives capable of discriminating between serotonin 5-HT1A, 5-HT2A, 5-HT2C receptor subtypes. Bioorg Med Chem18:4783-92 (2011) 
 
5-hydroxytryptamine receptor 2C
Name:5-hydroxytryptamine receptor 2C
Type:G Protein-Coupled Receptor (GPCR)
Mol. Mass.:51836.79
Organism:Homo sapiens (Human)
Description:P28335
Residue:458
BDBM50321886
NameBDBM50321886
Synonyms:(E)-5-[(5,6-Dichloro-1H-indol-3-yl)methylene]-2-imino-1,3-dimethylimidazolidin-4-one | CHEMBL1173334
TypeSmall organic molecule
Emp. Form.C14H12Cl2N4O
Mol. Mass.323.177
SMILESCN1C(=N)N(C)\C(=C\c2c[nH]c3cc(Cl)c(Cl)cc23)C1=O