Reaction Details
Target5-hydroxytryptamine receptor 2A
LigandBDBM50321873
Substrate/Competitorn/a
Meas. Tech.ChEMBL_642098 (CHEMBL1176402)
Ki 126±n/a nM
Citation Cummings, DFCanseco, DCSheth, PJohnson, JESchetz, JA Synthesis and structure-affinity relationships of novel small molecule natural product derivatives capable of discriminating between serotonin 5-HT1A, 5-HT2A, 5-HT2C receptor subtypes. Bioorg Med Chem18:4783-92 (2011) 
 
5-hydroxytryptamine receptor 2A
Name:5-hydroxytryptamine receptor 2A
Type:undefined
Mol. Mass.:52607.65
Organism:Homo sapiens (Human)
Description:P28223
Residue:471
BDBM50321873
NameBDBM50321873
Synonyms:4-Bromo-5-methyl-2,3-dihydro-indole-1-carboxylic acid pyridin-3-ylamide CHEMBL42463
TypeSmall organic molecule
Emp. Form.C15H14BrN3O
Mol. Mass.332.195
SMILESCc1ccc2N(CCc2c1Br)C(=O)Nc1cccnc1