Reaction Details
Target5-hydroxytryptamine receptor 2A
LigandBDBM50321879
Substrate/Competitorn/a
Meas. Tech.ChEMBL_642098 (CHEMBL1176402)
Ki 159±n/a nM
Citation Cummings, DFCanseco, DCSheth, PJohnson, JESchetz, JA Synthesis and structure-affinity relationships of novel small molecule natural product derivatives capable of discriminating between serotonin 5-HT1A, 5-HT2A, 5-HT2C receptor subtypes. Bioorg Med Chem18:4783-92 (2011) 
 
5-hydroxytryptamine receptor 2A
Name:5-hydroxytryptamine receptor 2A
Type:undefined
Mol. Mass.:52607.65
Organism:Homo sapiens (Human)
Description:P28223
Residue:471
BDBM50321879
NameBDBM50321879
Synonyms:(R,S)-1-(5-bromo-1H-indol-1-yl)propan-2-amine CHEMBL276673
TypeSmall organic molecule
Emp. Form.C11H13BrN2
Mol. Mass.253.138
SMILESCC(N)Cn1ccc2cc(Br)ccc12