Reaction Details
TargetProto-oncogene tyrosine-protein kinase Src
LigandBDBM50321964
Substrate/Competitorn/a
Meas. Tech.ChEMBL_642324 (CHEMBL1177350)
IC50 750±n/a nM
Citation Huang, HMa, JShi, JMeng, LJiang, HDing, JLiu, H Discovery of novel purine derivatives with potent and selective inhibitory activity against c-Src tyrosine kinase. Bioorg Med Chem18:4615-24 (2011) 
 
Proto-oncogene tyrosine-protein kinase Src
Name:Proto-oncogene tyrosine-protein kinase Src
Type:Protein
Mol. Mass.:59838.60
Organism:Homo sapiens (Human)
Description:P12931
Residue:536
BDBM50321964
NameBDBM50321964
Synonyms:CHEMBL1173388 | N-phenyl-2-morpholino-9H-purin-6-amine
TypeSmall organic molecule
Emp. Form.C15H16N6O
Mol. Mass.296.3271
SMILESC1CN(CCO1)c1nc(Nc2ccccc2)c2[nH]cnc2n1