Reaction Details
TargetProto-oncogene tyrosine-protein kinase Src
LigandBDBM50321966
Substrate/Competitorn/a
Meas. Tech.ChEMBL_642324 (CHEMBL1177350)
IC50 930±n/a nM
Citation Huang, HMa, JShi, JMeng, LJiang, HDing, JLiu, H Discovery of novel purine derivatives with potent and selective inhibitory activity against c-Src tyrosine kinase. Bioorg Med Chem18:4615-24 (2011) 
 
Proto-oncogene tyrosine-protein kinase Src
Name:Proto-oncogene tyrosine-protein kinase Src
Type:Protein
Mol. Mass.:59838.60
Organism:Homo sapiens (Human)
Description:P12931
Residue:536
BDBM50321966
NameBDBM50321966
Synonyms:CHEMBL1173484 | N-(3-Methoxyphenyl)-2-morpholino-9H-purin-6-amine
TypeSmall organic molecule
Emp. Form.C16H18N6O2
Mol. Mass.326.3531
SMILESCOc1cccc(Nc2nc(nc3nc[nH]c23)N2CCOCC2)c1