Reaction Details
TargetProto-oncogene tyrosine-protein kinase Src
LigandBDBM50321970
Substrate/Competitorn/a
Meas. Tech.ChEMBL_642324 (CHEMBL1177350)
IC50 390±n/a nM
Citation Huang, HMa, JShi, JMeng, LJiang, HDing, JLiu, H Discovery of novel purine derivatives with potent and selective inhibitory activity against c-Src tyrosine kinase. Bioorg Med Chem18:4615-24 (2011) 
 
Proto-oncogene tyrosine-protein kinase Src
Name:Proto-oncogene tyrosine-protein kinase Src
Type:Protein
Mol. Mass.:59838.60
Organism:Homo sapiens (Human)
Description:P12931
Residue:536
BDBM50321970
NameBDBM50321970
Synonyms:CHEMBL1173553 | N-(4-Nitrophenyl)-2-morpholino-9H-purin-6-amine
TypeSmall organic molecule
Emp. Form.C15H15N7O3
Mol. Mass.341.3247
SMILES[O-][N+](=O)c1ccc(Nc2nc(nc3nc[nH]c23)N2CCOCC2)cc1