Reaction Details
TargetProto-oncogene tyrosine-protein kinase Src
LigandBDBM50321981
Substrate/Competitorn/a
Meas. Tech.ChEMBL_642324 (CHEMBL1177350)
IC50 340±n/a nM
Citation Huang, HMa, JShi, JMeng, LJiang, HDing, JLiu, H Discovery of novel purine derivatives with potent and selective inhibitory activity against c-Src tyrosine kinase. Bioorg Med Chem18:4615-24 (2011) 
 
Proto-oncogene tyrosine-protein kinase Src
Name:Proto-oncogene tyrosine-protein kinase Src
Type:Protein
Mol. Mass.:59838.60
Organism:Homo sapiens (Human)
Description:P12931
Residue:536
BDBM50321981
NameBDBM50321981
Synonyms:CHEMBL1173225 | N-(3-Nitrophenyl)-2-(4-(2-hydroxyethyl)piperazin-1-yl)-9H-purin-6-amine
TypeSmall organic molecule
Emp. Form.C17H20N8O3
Mol. Mass.384.3925
SMILESOCCN1CCN(CC1)c1nc(Nc2cccc(c2)[N+]([O-])=O)c2[nH]cnc2n1