Reaction Details
TargetProto-oncogene tyrosine-protein kinase Src
LigandBDBM50321952
Substrate/Competitorn/a
Meas. Tech.ChEMBL_642324 (CHEMBL1177350)
IC50>10000±n/a nM
Citation Huang, HMa, JShi, JMeng, LJiang, HDing, JLiu, H Discovery of novel purine derivatives with potent and selective inhibitory activity against c-Src tyrosine kinase. Bioorg Med Chem18:4615-24 (2011) 
 
Proto-oncogene tyrosine-protein kinase Src
Name:Proto-oncogene tyrosine-protein kinase Src
Type:Protein
Mol. Mass.:59838.60
Organism:Homo sapiens (Human)
Description:P12931
Residue:536
BDBM50321952
NameBDBM50321952
Synonyms:9-benzyl-N-(4-methoxyphenyl)-2-(piperazin-1-yl)-9H-purin-6-amine | CHEMBL1173031
TypeSmall organic molecule
Emp. Form.C23H25N7O
Mol. Mass.415.4909
SMILESCOc1ccc(Nc2nc(nc3n(Cc4ccccc4)cnc23)N2CCNCC2)cc1