Reaction Details
TargetProto-oncogene tyrosine-protein kinase Src
LigandBDBM50321954
Substrate/Competitorn/a
Meas. Tech.ChEMBL_642324 (CHEMBL1177350)
IC50 2430±n/a nM
Citation Huang, HMa, JShi, JMeng, LJiang, HDing, JLiu, H Discovery of novel purine derivatives with potent and selective inhibitory activity against c-Src tyrosine kinase. Bioorg Med Chem18:4615-24 (2011) 
 
Proto-oncogene tyrosine-protein kinase Src
Name:Proto-oncogene tyrosine-protein kinase Src
Type:Protein
Mol. Mass.:59838.60
Organism:Homo sapiens (Human)
Description:P12931
Residue:536
BDBM50321954
NameBDBM50321954
Synonyms:CHEMBL1173735 | N-(4-Methoxyphenyl)-2-(piperazin-1-yl)-9H-purin-6-amine
TypeSmall organic molecule
Emp. Form.C16H19N7O
Mol. Mass.325.3684
SMILESCOc1ccc(Nc2nc(nc3nc[nH]c23)N2CCNCC2)cc1