Reaction Details
Target6-phosphogluconate dehydrogenase, decarboxylating
LigandBDBM50148780
Substrate/Competitorn/a
Meas. Tech.ChEMBL_642682 (CHEMBL1176974)
Ki 1100±n/a nM
Citation Ruda, GFCampbell, GAlibu, VPBarrett, MPBrenk, RGilbert, IH Virtual fragment screening for novel inhibitors of 6-phosphogluconate dehydrogenase. Bioorg Med Chem18:5056-62 (2010) 
 
6-phosphogluconate dehydrogenase, decarboxylating
Name:6-phosphogluconate dehydrogenase, decarboxylating
Type:PROTEIN
Mol. Mass.:52976.41
Organism:Ovis aries
Description:ChEMBL_642682
Residue:483
BDBM50148780
NameBDBM50148780
Synonyms:((4R,5R)-5-(hydroxycarbamoyl)-2,2-dimethyl-1,3-dioxolan-4-yl)methyl dihydrogen phosphate CHEMBL324609 | Phosphoric acid mono-((R)-(R)-5-hydroxycarbamoyl-2,2-dimethyl-[1,3]dioxolan-4-ylmethyl) ester
TypeSmall organic molecule
Emp. Form.C7H14NO8P
Mol. Mass.271.1617
SMILESCC1(C)O[C@H](COP(O)(O)=O)[C@@H](O1)C(=O)NO