Reaction Details
TargetCathepsin B
LigandBDBM50257018
Substrate/Competitorn/a
Meas. Tech.ChEMBL_642741 (CHEMBL1177221)
Ki 7300±n/a nM
Citation Bova, FEttari, RMicale, NCarnovale, CSchirmeister, TGelhaus, CLeippe, MGrasso, SZappalà, M Constrained peptidomimetics as antiplasmodial falcipain-2 inhibitors. Bioorg Med Chem18:4928-38 (2010) 
 
Cathepsin B
Name:Cathepsin B
Type:Enzyme
Mol. Mass.:37819.69
Organism:Homo sapiens (Human)
Description:gi_63102437
Residue:339
BDBM50257018
NameBDBM50257018
Synonyms:(E)-methyl4-(2-((R,Z)-3-((4-chloro-2-(trifluoromethyl)phenylcarbamoyloxy)methyl)-2-oxo-5-phenyl-2,3-dihydro-1H-benzo[e][1,4]diazepin-1-yl)acetamido)but-2-enoate CHEMBL501901
TypeSmall organic molecule
Emp. Form.C31H26ClF3N4O6
Mol. Mass.643.01
SMILESCOC(=O)\C=C\CNC(=O)CN1c2ccccc2C(=N[C@H](COC(=O)Nc2ccc(Cl)cc2C(F)(F)F)C1=O)c1ccccc1