Reaction Details
TargetProcathepsin L
LigandBDBM50322342
Substrate/Competitorn/a
Meas. Tech.ChEMBL_642742 (CHEMBL1177222)
Ki 29800±n/a nM
Citation Bova, FEttari, RMicale, NCarnovale, CSchirmeister, TGelhaus, CLeippe, MGrasso, SZappalà, M Constrained peptidomimetics as antiplasmodial falcipain-2 inhibitors. Bioorg Med Chem18:4928-38 (2010) 
 
Procathepsin L
Name:Procathepsin L
Type:Enzyme
Mol. Mass.:37557.19
Organism:Homo sapiens (Human)
Description:Purchased from Calbiochem (San Diego, CA).
Residue:333
BDBM50322342
NameBDBM50322342
Synonyms:(R)-Methyl4-(2-(7-chloro-3-((4-chloro-2-(trifluoromethyl)phenylcarbamoyloxy)methyl-2-oxo-5-phenyl-2,3-dihydro-1Hbenzo[e][1,4]diazepin-1-yl)acetamido)but-2-enoate | CHEMBL1171804
TypeSmall organic molecule
Emp. Form.C31H25Cl2F3N4O6
Mol. Mass.677.455
SMILESCOC(=O)\C=C\CNC(=O)CN1c2ccc(Cl)cc2C(=N[C@H](COC(=O)Nc2ccc(Cl)cc2C(F)(F)F)C1=O)c1ccccc1