Reaction Details
TargetProcathepsin L
LigandBDBM50322344
Substrate/Competitorn/a
Meas. Tech.ChEMBL_642742 (CHEMBL1177222)
Ki 59900±n/a nM
Citation Bova, FEttari, RMicale, NCarnovale, CSchirmeister, TGelhaus, CLeippe, MGrasso, SZappalà, M Constrained peptidomimetics as antiplasmodial falcipain-2 inhibitors. Bioorg Med Chem18:4928-38 (2010) 
 
Procathepsin L
Name:Procathepsin L
Type:Enzyme
Mol. Mass.:37557.19
Organism:Homo sapiens (Human)
Description:Purchased from Calbiochem (San Diego, CA).
Residue:333
BDBM50322344
NameBDBM50322344
Synonyms:(R)-Methyl4-(2-(3-((4-chloro-2-(trifluoromethyl)phenylcarbamoyloxy)-5-(methoxyphenyl)-2-oxo-2,3-dihydro-1H-benzo[e][1,4]diazepin-1-yl)acetamido)but-2-enoate | CHEMBL1171634
TypeSmall organic molecule
Emp. Form.C32H28ClF3N4O7
Mol. Mass.673.036
SMILESCOC(=O)\C=C\CNC(=O)CN1c2ccccc2C(=N[C@H](COC(=O)Nc2ccc(Cl)cc2C(F)(F)F)C1=O)c1ccc(OC)cc1