Reaction Details
TargetProcathepsin L
LigandBDBM50322349
Substrate/Competitorn/a
Meas. Tech.ChEMBL_642742 (CHEMBL1177222)
Ki 65000±n/a nM
Citation Bova, FEttari, RMicale, NCarnovale, CSchirmeister, TGelhaus, CLeippe, MGrasso, SZappalà, M Constrained peptidomimetics as antiplasmodial falcipain-2 inhibitors. Bioorg Med Chem18:4928-38 (2010) 
 
Procathepsin L
Name:Procathepsin L
Type:Enzyme
Mol. Mass.:37557.19
Organism:Homo sapiens (Human)
Description:Purchased from Calbiochem (San Diego, CA).
Residue:333
BDBM50322349
NameBDBM50322349
Synonyms:(R)-Methyl4-(2-(3-((adamantan-1-ylcarbamoyloxy)methyl)-2-oxo-5-phenyl-2,3-dihydro-1H-benzo[e][1,4]diazepin-1-yl)acetamido)but-2-enoate | CHEMBL1171802
TypeSmall organic molecule
Emp. Form.C34H38N4O6
Mol. Mass.598.6887
SMILESCOC(=O)\C=C\CNC(=O)CN1c2ccccc2C(=N[C@H](COC(=O)NC23CC4CC(CC(C4)C2)C3)C1=O)c1ccccc1