Reaction Details
TargetFalcipain 2
LigandBDBM50322342
Substrate/Competitorn/a
Meas. Tech.ChEMBL_642736 (CHEMBL1177216)
Ki 460±n/a nM
Citation Bova, FEttari, RMicale, NCarnovale, CSchirmeister, TGelhaus, CLeippe, MGrasso, SZappalà, M Constrained peptidomimetics as antiplasmodial falcipain-2 inhibitors. Bioorg Med Chem18:4928-38 (2010) 
 
Falcipain 2
Name:Falcipain 2
Type:Enzyme
Mol. Mass.:55912.60
Organism:Plasmodium falciparum
Description:Recombinant falcipain-2.
Residue:484
BDBM50322342
NameBDBM50322342
Synonyms:(R)-Methyl4-(2-(7-chloro-3-((4-chloro-2-(trifluoromethyl)phenylcarbamoyloxy)methyl-2-oxo-5-phenyl-2,3-dihydro-1Hbenzo[e][1,4]diazepin-1-yl)acetamido)but-2-enoate | CHEMBL1171804
TypeSmall organic molecule
Emp. Form.C31H25Cl2F3N4O6
Mol. Mass.677.455
SMILESCOC(=O)\C=C\CNC(=O)CN1c2ccc(Cl)cc2C(=N[C@H](COC(=O)Nc2ccc(Cl)cc2C(F)(F)F)C1=O)c1ccccc1