Reaction Details
TargetFalcipain 2
LigandBDBM50322343
Substrate/Competitorn/a
Meas. Tech.ChEMBL_642736 (CHEMBL1177216)
Ki 1560±n/a nM
Citation Bova, FEttari, RMicale, NCarnovale, CSchirmeister, TGelhaus, CLeippe, MGrasso, SZappalà, M Constrained peptidomimetics as antiplasmodial falcipain-2 inhibitors. Bioorg Med Chem18:4928-38 (2010) 
 
Falcipain 2
Name:Falcipain 2
Type:Enzyme
Mol. Mass.:55912.60
Organism:Plasmodium falciparum
Description:Recombinant falcipain-2.
Residue:484
BDBM50322343
NameBDBM50322343
Synonyms:(R)-Methyl4-(2-(5-(4-bromophenyl)-3-((4-chloro-2-(trifluoromethyl)phenylcarbamoyloxy)methyl-2-oxo-2,3-dihydro-1H-benzo[e][1,4]diazepin-1-yl)acetamido)but-2-enoate | CHEMBL1171633
TypeSmall organic molecule
Emp. Form.C31H25BrClF3N4O6
Mol. Mass.721.906
SMILESCOC(=O)\C=C\CNC(=O)CN1c2ccccc2C(=N[C@H](COC(=O)Nc2ccc(Cl)cc2C(F)(F)F)C1=O)c1ccc(Br)cc1