Reaction Details
TargetCytochrome P450 11B1, mitochondrial
LigandBDBM25458
Substrate/Competitorn/a
Meas. Tech.ChEMBL_642392 (CHEMBL1177585)
IC50 1610±n/a nM
Citation Hu, QYin, LJagusch, CHille, UEHartmann, RW Isopropylidene substitution increases activity and selectivity of biphenylmethylene 4-pyridine type CYP17 inhibitors. J Med Chem53:5049-53 (2010) 
 
Cytochrome P450 11B1, mitochondrial
Name:Cytochrome P450 11B1, mitochondrial
Type:Enzyme
Mol. Mass.:57591.44
Organism:Homo sapiens (Human)
Description:P15538
Residue:503
BDBM25458
NameBDBM25458
Synonyms:(1S,2R,5S,10R,11S,15S)-2,15-dimethyl-14-(pyridin-3-yl)tetracyclo[8.7.0.0^{2,7}.0^{11,15}]heptadeca-7,13-dien-5-ol Abiraterone CHEMBL254328 US9611270, Example 5, abiraterone
Typesteroidal compound
Emp. Form.C24H31NO
Mol. Mass.349.509
SMILES[H][C@@]12CC=C(c3cccnc3)[C@@]1(C)CC[C@@]1([H])[C@@]2([H])CC=C2C[C@@H](O)CC[C@]12C