Reaction Details
TargetAndrogen receptor
LigandBDBM50323015
Substrate/Competitorn/a
Meas. Tech.ChEMBL_643541 (CHEMBL1212405)
IC50 32±n/a nM
Citation Xiao, HYBalog, AAttar, RMFairfax, DFleming, LBHolst, CLMartin, GSRossiter, LMChen, JCvjic, MEDell-John, JGeng, JGottardis, MMHan, WCNation, AObermeier, MRizzo, CASchweizer, LSpires, TShan, WGavai, ASalvati, MEVite, G Design and synthesis of 4-[3,5-dioxo-11-oxa-4,9-diazatricyclo[5.3.1.0(2,6)]undec-4-yl]-2-trifluoromethyl-benzonitriles as androgen receptor antagonists. Bioorg Med Chem Lett20:4491-5 (2010) 
 
Androgen receptor
Name:Androgen receptor
Type:Receptor
Mol. Mass.:99185.27
Organism:Homo sapiens (Human)
Description:CHO cells were stably transfected with human AR gene.
Residue:920
BDBM50323015
NameBDBM50323015
Synonyms:4-((1S,2S,6R,7R)-9-Isopropyl-1,7-dimethyl-3,5,8,10-tetraoxo-11-oxa-4,9-diaza-tricyclo[5.3.1.0*2,6*]undec-4-yl)-2-trifluoromethyl-benzonitrile | CHEMBL1210908
TypeSmall organic molecule
Emp. Form.C21H18F3N3O5
Mol. Mass.449.3799
SMILESCC(C)N1C(=O)[C@]2(C)O[C@@](C)(c3c(O)n(c(O)c23)-c2ccc(C#N)c(c2)C(F)(F)F)C1=O