Reaction Details
TargetCarbonic anhydrase 1
LigandBDBM50323341
Substrate/Competitorn/a
Meas. Tech.ChEMBL_643923 (CHEMBL1211822)
Ki 362±n/a nM
Citation Avvaru, BSWagner, JMMaresca, AScozzafava, ARobbins, AHSupuran, CTMcKenna, R Carbonic anhydrase inhibitors. The X-ray crystal structure of human isoform II in adduct with an adamantyl analogue of acetazolamide resides in a less utilized binding pocket than most hydrophobic inhibitors. Bioorg Med Chem Lett20:4376-81 (2010) 
 
Carbonic anhydrase 1
Name:Carbonic anhydrase 1
Type:Enzyme
Mol. Mass.:28873.37
Organism:Homo sapiens (Human)
Description:P00915
Residue:261
BDBM50323341
NameBDBM50323341
Synonyms:CHEMBL1209039
TypeSmall organic molecule
Emp. Form.C14H20N4O3S2
Mol. Mass.356.464
SMILESNS(=O)(=O)c1nnc(NC(=O)CC23CC4CC(CC(C4)C2)C3)s1