Reaction Details
TargetCarbonic anhydrase 5A, mitochondrial
LigandBDBM11625
Substrate/Competitorn/a
Meas. Tech.ChEMBL_643927 (CHEMBL1211826)
Ki 21±n/a nM
Citation Avvaru, BSWagner, JMMaresca, AScozzafava, ARobbins, AHSupuran, CTMcKenna, R Carbonic anhydrase inhibitors. The X-ray crystal structure of human isoform II in adduct with an adamantyl analogue of acetazolamide resides in a less utilized binding pocket than most hydrophobic inhibitors. Bioorg Med Chem Lett20:4376-81 (2010) 
 
Carbonic anhydrase 5A, mitochondrial
Name:Carbonic anhydrase 5A, mitochondrial
Type:Enzyme
Mol. Mass.:34755.54
Organism:Homo sapiens (Human)
Description:Human (cloned) isozyme
Residue:305
BDBM11625
NameBDBM11625
Synonyms:2-N-(4-amino-3-chloro-5-fluorobenzene)-1,3,4-thiadiazole-2,5-disulfonamide CHEMBL71611 | aminobenzolamide 18
TypeSmall organic molecule
Emp. Form.C8H7ClFN5O4S3
Mol. Mass.387.819
SMILESNc1c(F)cc(cc1Cl)S(=O)(=O)Nc1nnc(s1)S(N)(=O)=O