Reaction Details
TargetSodium-dependent noradrenaline transporter
LigandBDBM50323773
Substrate/Competitorn/a
Meas. Tech.ChEMBL_646995 (CHEMBL1217136)
Ki 87±n/a nM
Citation Stehouwer, JSDaniel, LMChen, PVoll, RJWilliams, LPlott, SJVotaw, JROwens, MJHowell, LGoodman, MM Synthesis, fluorine-18 radiolabeling, and biological evaluation of N-((E)-4-fluorobut-2-en-1-yl)-2beta-carbomethoxy-3beta-(4'-halophenyl)nortropanes: candidate radioligands for in vivo imaging of the brain dopamine transporter with positron emission tomography. J Med Chem53:5549-57 (2010) 
 
Sodium-dependent noradrenaline transporter
Name:Sodium-dependent noradrenaline transporter
Type:Multi-pass membrane protein
Mol. Mass.:69337.72
Organism:Homo sapiens (Human)
Description:P23975
Residue:617
BDBM50323773
NameBDBM50323773
Synonyms:CHEMBL1214007 | N-((E)-4-Fluorobut-2-en-1-yl)-2beta-carbomethoxy-3beta-(4'-bromophenyl)nortropane
TypeSmall organic molecule
Emp. Form.C19H23BrFNO2
Mol. Mass.396.294
SMILESCOC(=O)[C@@H]1C2CCC(C[C@@H]1c1ccc(Br)cc1)N2C\C=C\CF