Reaction Details
TargetCannabinoid receptor 1
LigandBDBM50324642
Substrate/Competitorn/a
Meas. Tech.ChEMBL_649739 (CHEMBL1219437)
Ki>10000±n/a nM
Citation Pasquini, SLigresti, AMugnaini, CSemeraro, TCicione, LDe Rosa, MGuida, FLuongo, LDe Chiaro, MCascio, MGBolognini, DMarini, PPertwee, RMaione, SDi Marzo, VCorelli, F Investigations on the 4-quinolone-3-carboxylic acid motif. 3. Synthesis, structure-affinity relationships, and pharmacological characterization of 6-substituted 4-quinolone-3-carboxamides as highly selective cannabinoid-2 receptor ligands. J Med Chem53:5915-28 (2010) 
 
Cannabinoid receptor 1
Name:Cannabinoid receptor 1
Type:G Protein-Coupled Receptor (GPCR)
Mol. Mass.:52868.96
Organism:Homo sapiens (Human)
Description:P21554
Residue:472
BDBM50324642
NameBDBM50324642
Synonyms:6-(3,5-Dimethyl-isoxazol-4-yl)-4-oxo-1-pentyl-1,4-dihydro-quinoline-3-carboxylic acid adamantan-1-ylamide | CHEMBL1215901
TypeSmall organic molecule
Emp. Form.C30H37N3O3
Mol. Mass.487.6331
SMILESCCCCCn1cc(C(=O)NC23CC4CC(CC(C4)C2)C3)c(=O)c2cc(ccc12)-c1c(C)noc1C