Reaction Details
TargetCannabinoid receptor 1
LigandBDBM50324658
Substrate/Competitorn/a
Meas. Tech.ChEMBL_649739 (CHEMBL1219437)
Ki 2.8±n/a nM
Citation Pasquini, SLigresti, AMugnaini, CSemeraro, TCicione, LDe Rosa, MGuida, FLuongo, LDe Chiaro, MCascio, MGBolognini, DMarini, PPertwee, RMaione, SDi Marzo, VCorelli, F Investigations on the 4-quinolone-3-carboxylic acid motif. 3. Synthesis, structure-affinity relationships, and pharmacological characterization of 6-substituted 4-quinolone-3-carboxamides as highly selective cannabinoid-2 receptor ligands. J Med Chem53:5915-28 (2010) 
 
Cannabinoid receptor 1
Name:Cannabinoid receptor 1
Type:G Protein-Coupled Receptor (GPCR)
Mol. Mass.:52868.96
Organism:Homo sapiens (Human)
Description:P21554
Residue:472
BDBM50324658
NameBDBM50324658
Synonyms:6-bromo-4-oxo-1-pentyl-N-((1R,2R,4S)-1,3,3-trimethylbicyclo[2.2.1]heptan-2-yl)-1,4-dihydroquinoline-3-carboxamide | CHEMBL1215991
TypeSmall organic molecule
Emp. Form.C25H33BrN2O2
Mol. Mass.473.446
SMILESCCCCCn1cc(C(=O)N[C@H]2C(C)(C)[C@H]3CC[C@]2(C)C3)c(=O)c2cc(Br)ccc12