Reaction Details
TargetCannabinoid receptor 2
LigandBDBM50324650
Substrate/Competitorn/a
Meas. Tech.ChEMBL_649740 (CHEMBL1219438)
Ki 8.8±n/a nM
Citation Pasquini, SLigresti, AMugnaini, CSemeraro, TCicione, LDe Rosa, MGuida, FLuongo, LDe Chiaro, MCascio, MGBolognini, DMarini, PPertwee, RMaione, SDi Marzo, VCorelli, F Investigations on the 4-quinolone-3-carboxylic acid motif. 3. Synthesis, structure-affinity relationships, and pharmacological characterization of 6-substituted 4-quinolone-3-carboxamides as highly selective cannabinoid-2 receptor ligands. J Med Chem53:5915-28 (2010) 
 
Cannabinoid receptor 2
Name:Cannabinoid receptor 2
Type:G Protein-Coupled Receptor (GPCR)
Mol. Mass.:39690.94
Organism:Homo sapiens (Human)
Description:P34972
Residue:360
BDBM50324650
NameBDBM50324650
Synonyms:CHEMBL1215888 | N-(Adamantan-1-yl)-6-ethynyl-4-oxo-1-pentyl-1,4-dihydroquinoline-3-carboxamide
TypeSmall organic molecule
Emp. Form.C27H32N2O2
Mol. Mass.416.5552
SMILESCCCCCn1cc(C(=O)NC23CC4CC(CC(C4)C2)C3)c(=O)c2cc(ccc12)C#C